RDF description of
primary topic: pédique

pédique
type: Concept
subject: Pedology @en
subject: Agronomie
subject: Pédologie
subject: Agronomy @en
definition: Qualifie la structure d'un horizon qui est constitué d'agrégats. (Source : INRA)
in scheme: PLP
preferred label: pedal @en
related: http://opendata.inrae.fr/PLP/907
related: http://opendata.inrae.fr/PLP/920
top concept of: PLP