aquifère
type: Concept
subject: Geology @en
subject: Géologie
definition: Couche géométriquement définie de roches perméables comportant une zone saturée et suffisamment conductrice pour permettre l'écoulement significatif d'une nappe souterraine et le captage de quantités d'eau appréciables. (Source : INRA)
in scheme: PLP
preferred label: aquifer @en
related: http://opendata.inrae.fr/PLP/639
related: http://opendata.inrae.fr/PLP/640
top concept of: PLP

RDF description of
primary topic: aquifère