pédodiversité
type: Concept
subject: Pedology @en
subject: Pédologie
definition: Transposition du concept de biodiversité utilisé en biologie et appliqué aux sols. (Source : INRA)
in scheme: PLP
note: La diversité des types de sols d'un territoire dépendra beaucoup plus des capacités et du talent du cartographe, du degré de détail de la typologie employée et de la variabilité des facteurs de la pédogenèse, notamment de la lithologie, que d'une propriété naturelle supposée des couvertures pédologiques. (Source : INRA)
preferred label: pedodiversity @en
related: http://opendata.inrae.fr/PLP/990
related: http://opendata.inrae.fr/PLP/996
top concept of: PLP

RDF description of
primary topic: pédodiversité