RDF description of
primary topic: pédon

pédon
type: Concept
subject: Pedology @en
subject: Pédologie
definition: Unité d'échantillonnage de la Soil Taxonomy définie comme un corps pédologique tridimensionnel qui a des dimensions latérales suffisamment grandes pour inclure les variations représentatives dans la forme et les relations des horizons et dans la composition du sol et dont la superficie varie de 1 à 10 mètres carré selon la nature de la variabilité dans le sol. (Source : INRA)
in scheme: PLP
note: Ce concept assez artificiel n'a pas été retenu par le Référentiel Pédologique car jugé sans nécessité pratique ni théorique. (Source : INRA)
preferred label: pedon @en
related: http://opendata.inrae.fr/PLP/868
related: http://opendata.inrae.fr/PLP/736
related: http://opendata.inrae.fr/PLP/522
related: http://opendata.inrae.fr/PLP/885
top concept of: PLP