RDF description of
primary topic: soil landscape

soil landscape
type: Concept
subject: Pedology
subject: Pédologie @fr
modified: 2020-08-27T15:21:24.961+02:00
alternative label: soilscape
definition: Ensemble des horizons pédologiques et des éléments du paysage (végétation, effets des activités humaines, géomorphologie, hydrologie, roches-mères ou substrats) dont l'organisation spatiale permet de définir, dans son ensemble, tout ou partie d'une couverture pédologique (Référentiel Pédologique). (Source : INRA) @fr
in scheme: PLP
preferred label: pédopaysage @fr
related: http://opendata.inrae.fr/PLP/676
related: http://opendata.inrae.fr/PLP/787
top concept of: PLP