arable
type: Concept
subject: Agronomie @fr
subject: Agronomy
alternative label: ploughed
definition: Qualifie un terrain qui est ou pourrait être labouré ou cultivé, ou la couche supérieure d'un sol cultivé qui est effectivement labourée. (Source : INRA) @fr
in scheme: PLP
top concept of: PLP

RDF description of
primary topic: arable