RDF description of
primary topic: architecture d'un horizon de sol

architecture d'un horizon de sol
type: Concept
subject: Pedology @en
subject: Agronomie
subject: Pédologie
subject: Agronomy @en
modified: 2020-07-03T13:34:54.821+02:00
alternative label: soil architecture @en
definition: Mode d'assemblage des éléments structuraux d'un horizon de sol, qui conditionne la circulation de l'air et de l'eau et donc le drainage agricole. (Source : INRA)
in scheme: PLP
note: L'architecture est dite "ajustée" quand les agrégats, anguleux, bien individualisés et délimités par un système de fissures, s'emboîtent de telle façon que, une fois réhumectés, ils ne laissent aucun écart entre eux pour la percolation de l'eau (sans pour autant se souder). Elle est dite "lâche" ou "ouverte" si les éléments structuraux sont empilés sans emboîtement, en ménageant, même à leur humidité maximale, des lacunes suffisantes pour une rapide circulation de l'eau. Rare dans les horizons profonds, cette architecture lâche est souvent le résultat d'interventions humaines (labours, sous-solages, etc.). (Source : INRA)
preferred label: overall structure (horizon) @en
related: http://opendata.inrae.fr/PLP/892
related: http://opendata.inrae.fr/PLP/696
related: http://opendata.inrae.fr/PLP/23
top concept of: PLP