pédothèque
type: Concept
subject: Pedology @en
subject: Pédologie
definition: Lieu où sont stockés de façon rationnelle et dans de bonnes conditions de conservation des quantités importantes d'échantillons de sols. (Source : INRA)
in scheme: PLP
note: L'objectif de la création d'une pédothèque est de disposer de plusieurs kilogrammes d'échantillons de sols parfaitement identifiés et caractérisés que l'on pourra réanalyser plus tard, si nécessaire. (Source : INRA)
preferred label: soil library @en
top concept of: PLP

RDF description of
primary topic: pédothèque