RDF description of
primary topic: pédoturbation

pédoturbation
type: Concept
subject: Pedology @en
subject: Pédologie
definition: Mouvements locaux, de quelques cm à quelques dm, des matériaux des sols sous l'influence de l'activité biologique sous toutes ses formes, du gel et du dégel ou du gonflement des minéraux argileux, à l'exception des transferts par illuviation. (Source : INRA)
in scheme: PLP
preferred label: pedoturbation @en
top concept of: PLP