pélosols
type: Concept
subject: Pedology @en
subject: Pédologie
definition: Sols argileux assez jeunes et de ce fait assez peu évolués et différenciés qui se distinguent des autres sols argileux par deux caractères spécifiques, à savoir la faible évolution des minéraux phylliteux hérités directement de sédiments argileux (marnes, argilites) et des comportements structuraux et hydriques particuliers, défavorables à l'agriculture comme à la sylviculture (Référentiel Pédologique). (Source : INRA)
in scheme: PLP
note: Une faible perméabilité des horizons de moyenne profondeur, suite à l'absence de macro-porosité et à une architecture très ajustée des agrégats, génère un engorgement des horizons de surface en hiver et au printemps. On observe souvent des caractères vertiques en profondeur (faces de glissement) mais sans pédoturbation généralisée comme dans le cas des vertisols. Dans certains cas, on observe un net appauvrissement en argile des horizons de surface, ce qui pourrait indiquer une transition vers les planosols et ce qui accroît le contraste entre des horizons supérieurs assez perméables et des horizons plus profonds imperméables (Pélosols Différenciés). (Source : INRA)
related: http://opendata.inrae.fr/PLP/1001
related: http://opendata.inrae.fr/PLP/719
top concept of: PLP

RDF description of
primary topic: pélosols