pénétromètre
type: Concept
subject: Pedology @en
subject: Agronomie
subject: Pédologie
subject: Agronomy @en
definition: Petit appareil qui permet de comparer la résistance de différents horizons superposés à l'enfoncement vertical d'une tige métallique dans le sol. (Source : INRA)
in scheme: PLP
note: Cette tige comporte à son extrémité une pointe conique de section et d'angle connus. Le dispositif le plus simple comprend une masse coulissante venant frapper une butée et provoquant ainsi l'enfoncement du pénétromètre par chocs successifs. On dispose également d'une échelle graduée permettant de suivre l'enfoncement de la tige en fonction du nombre de coups. Les tests pénétrométriques sont très dépendants des conditions d'humidité des horizons traversés, ils sont donc surtout utiles pour comparer des points différents d'une même parcelle à un moment donné. Ils permettent de déceler la présence en profondeur d'horizons compacts, de semelles de labour localisées, de voûtes, ou, au contraire, de grosses cavités et lacunes. (Source : INRA)
preferred label: penetrometer @en
related: http://opendata.inrae.fr/PLP/846
related: http://opendata.inrae.fr/PLP/311
top concept of: PLP

RDF description of
primary topic: pénétromètre