percolation
type: Concept
subject: Pedology @en
subject: Pédologie
definition: Processus d'écoulement, de haut en bas, des eaux de précipitation ou d'irrigation et des substances qu'elles entraînent à travers les fissures du sol, lacunes ou galeries d'animaux. (Source : INRA)
in scheme: PLP
note: La percolation diffère de l'infiltration et de la filtration, car elle désigne essentiellement l'écoulement d'une eau qui transite rapidement. (Source : INRA)
related: http://opendata.inrae.fr/PLP/69
related: http://opendata.inrae.fr/PLP/698
related: http://opendata.inrae.fr/PLP/398
related: http://opendata.inrae.fr/PLP/963
related: http://opendata.inrae.fr/PLP/811
related: http://opendata.inrae.fr/PLP/524
top concept of: PLP

RDF description of
primary topic: percolation