RDF description of
primary topic: perméabilité

perméabilité
type: Concept
subject: Pedology @en
subject: Hydrologie
subject: Hydrology @en
subject: Pédologie
definition: Aptitude d'un horizon ou tout autre volume de sol à se laisser traverser par un fluide sous l'effet d'un gradient de potentiel. (Source : INRA)
in scheme: PLP
note: Elle s'exprime quantitativement (en ce qui concerne l'eau) par le coefficient de perméabilité de Darcy. (Source : INRA)
preferred label: permeability @en
related: http://opendata.inrae.fr/PLP/696
top concept of: PLP