RDF description of
primary topic: perte au feu

perte au feu
type: Concept
subject: Pedology @en
subject: Pédologie
definition: Perte de poids d'un échantillon après calcination à 1100 °C, rapportée au poids initial, séché à l'air. (Source : INRA)
in scheme: PLP
note: D'autres températures sont également employées, par exemple 650 °C pour les horizons holorganiques. Les échantillons contenant des quantités non négligeables de minéraux argileux, devront être chauffés à plus de 1000 °C afin que les processus de déshydratation, puis de désorganisation, enfin de recristallisation des argiles et des oxydes de fer s'effectuent entièrement (pertes de poids progressives entre 200 et 1000 °C). Si les échantillons contiennent des carbonates, un chauffage à plus de 1000 °C est également nécessaire. La perte au feu regroupe quatre pertes bien distinctes : - l'humidité résiduelle à 105 °C, - toutes les matières organiques qui brûlent, - l'eau de constitution des minéraux argileux (qui représente de 4,6 à 13 % du poids de ces minéraux argileux selon leur nature minéralogique), - lorsqu'il y a du CaCO3, il y a perte de 44 % du poids par décomposition et dégagement de CO2 ; s'il y a de la dolomite, il y a perte de 47,9 % selon le même mécanisme. C'est l'inverse du taux de cendres dans le cas d'horizons holorganiques. (Source : INRA)
preferred label: loss on ignition @en
related: http://opendata.inrae.fr/PLP/941
top concept of: PLP