phosphore
type: Concept
subject: Pedology @en
subject: Agronomie
subject: Pédologie
subject: Agronomy @en
alternative label: P
definition: Élément chimique majeur entrant dans la constitution de nombreux composés organiques, notamment des acides nucléiques et de l'adénosine triphosphate (ATP) et jouant un rôle fondamental dans la photosynthèse. (Source : INRA)
in scheme: PLP
note: L'analyse du phosphore des sols est presque toujours orientée vers l'estimation des quantités disponibles pour les plantes en vue de mettre en oeuvre une fertilisation phosphatée. Le phosphore dit assimilable appelé aussi réserve assimilable ou fraction labile, est celui susceptible d'être absorbé par les racines. On y trouve différentes formes d'anions (PO43-, PO4H 2-, PO4H2 ) : les uns dissous dans la solution du sol, d'autres plus ou moins fortement adsorbés sur les surfaces externes des minéraux argileux, mais aussi et surtout sur les surfaces sorbantes des oxyhydroxydes de fer et/ou d'aluminium. Il se pourrait enfin que les anions phosphoriques précipitent au contact du calcaire fin dit calcaire actif. Tous ces phénomènes de précipitation et d'adsorption sur les surfaces des minéraux argileux ou des oxyhydroxydes ont souvent été appelés rétrogradation ou fixation. (Source : INRA)
preferred label: phosphorus @en
related: http://opendata.inrae.fr/PLP/749
related: http://opendata.inrae.fr/PLP/1
related: http://opendata.inrae.fr/PLP/376
related: http://opendata.inrae.fr/PLP/315
top concept of: PLP

RDF description of
primary topic: phosphore