phyllosilicates
type: Concept
subject: Mineralogy
subject: Pedology
subject: Minéralogie @fr
subject: Pédologie @fr
alternative label: phyllites
alternative label: sheet silicates
definition: Famille de silicates en feuillets rassemblant essentiellement le talc, les micas et les minéraux argileux des sols. (Source : INRA) @fr
in scheme: PLP
related: http://opendata.inrae.fr/PLP/858
related: http://opendata.inrae.fr/PLP/615
top concept of: PLP

RDF description of
primary topic: phyllosilicates