lineage
type: Concept
subject: Pedology
subject: Pédologie @fr
alternative label: phylum
definition: Reconstitution, grâce à des raisonnements, des formes successives prises en un endroit par une couverture pédologique au cours de son évolution pédogénétique. (Source : INRA) @fr
in scheme: PLP
preferred label: phylum évolutif @fr
related: http://opendata.inrae.fr/PLP/682
top concept of: PLP

RDF description of
primary topic: lineage