RDF description of
primary topic: piézomètre

piézomètre
type: Concept
subject: Pedology @en
subject: Agronomie
subject: Pédologie
subject: Agronomy @en
modified: 2020-06-29T11:41:50.375+02:00
definition: Dispositif permettant de mesurer la profondeur de la limite supérieure d'une nappe libre (temporaire ou permanente, superficielle ou profonde) dans le sol et de suivre ses variations au cours du temps. (Source : INRA)
in scheme: PLP
note: En général, il s'agit de tubes percés de nombreux trous, enfoncés verticalement dans le sol. Le suivi du niveau d'eau dans le piézomètre peut se faire par relevé à intervalles plus ou moins réguliers ou par un enregistrement continu. (Source : INRA)
preferred label: piezometer @en
top concept of: PLP