RDF description of
primary topic: pisolithes

pisolithes
type: Concept
subject: Geology @en
subject: Pedology @en
subject: Géologie
subject: Pédologie
preferred label: pisolites
definition: Concrétions calcaires ou ferrugineuses ayant une forme ovoïde et la dimension d'un petit pois. (Source : INRA)
in scheme: PLP
top concept of: PLP