RDF description of
primary topic: plinthite

plinthite
type: Concept
subject: Pedology @en
subject: Pédologie
definition: Matériau d'altération de roches basiques des climats intertropicaux constitué d'un mélange d'argile et de quartz, riche en fer et pauvre en humus, susceptible de devenir aussi dur que de la brique après dessiccation à l'air. (Source : INRA)
in scheme: PLP
note: Sa formation se fait selon deux processus : - une accumulation relative ou absolue de sesquioxydes de fer ; - des ségrégations de taches rouges de fer liées à des phases successives d'oxydation et de réduction et organisées selon un motif polygonal ou réticulé. La plinthite se forme dans les zones basses et humides. Si le pédoclimat devient sec (descente du niveau de base, changement climatique), la plinthite durcit et devient une cuirasse ferrugineuse continue (pétroplinthite) par cristallisation des composés amorphes du fer sous la forme de goethite et déshydratation de la goethite en hématite et de la gibbsite en boehmite. (Source : INRA)
related: http://opendata.inrae.fr/PLP/723
top concept of: PLP