RDF description of
primary topic: plomb

plomb
type: Concept
subject: Geology @en
subject: Pedology @en
subject: Géologie
subject: Pédologie
subject: Environnement
subject: Environment @en
alternative label: Pb
definition: Élément chimique, toxique pour l'homme et les animaux, dont la teneur moyenne dans la croûte terrestre serait de 16 mg/kg. (Source : INRA)
in scheme: PLP
note: Dans les sols, les teneurs habituelles sont comprises entre 10 et 50 mg/kg tandis qu'elles dépassent nettement 100 en zones d'anomalies naturelles. Le plomb et ses composés tendent à s'accumuler dans les horizons de surface du fait de leur faible solubilité et mobilité. Généralement, une très faible proportion du plomb des sols est phytodisponible. Les sources principales de pollution des sols par le plomb sont les exploitations minières (actuelles ou anciennes), les fonderies, les épandages de boues d'épuration urbaines et les gaz d'échappement des véhicules. Seul le dosage des principaux isotopes permet de distinguer les sources anthropogènes et géogènes. (Source : INRA)
preferred label: lead @en
top concept of: PLP