RDF description of
primary topic: podzols

podzols
type: Concept
subject: Pedology @en
subject: Pédologie
definition: Groupe de sols de référence caractérisés par la présence en profondeur d'un horizon spodique constitué par l'accumulation de matières organiques et d'aluminium avec ou sans du fer et d'autres cations (WRB). (Source : INRA)
in scheme: PLP
note: Ces sols sont rares sous climats tempérés humides, limités aux affleurements de sables quartzeux purs, c'est-à-dire dénués de minéraux altérables (Landes de Gascogne, forêt de Fontainebleau, terrasses sableuses alluviales de Sologne). Le processus de translocation de ces substances (chéluviation, chilluviation) est matérialisé par la présence d'un horizon éluvial de teinte claire au-dessus de l'horizon spodique et il est très souvent vérifiable par l'existence de minces revêtements organiques sur les grains de sables dans l'horizon spodique. Les conditions favorables à la formation des podzols sont les climats froids et humides (zone boréale, hautes montagnes) agissant sur des matériaux quartzeux et les végétations acidifiantes. Terme très ancien, d'origine russe. (Source : INRA)
related: http://opendata.inrae.fr/PLP/726
related: http://opendata.inrae.fr/PLP/727
related: http://opendata.inrae.fr/PLP/176
related: http://opendata.inrae.fr/PLP/731
related: http://opendata.inrae.fr/PLP/475
related: http://opendata.inrae.fr/PLP/179
top concept of: PLP