arénosols
type: Concept
subject: Pedology @en
subject: Pédologie
modified: 2020-06-26T15:56:12.112+02:00
definition: Catégorie de sols faiblement différenciés dont la morphologie et les propriétés sont dominées par une granulométrie sableuse sur toute leur épaisseur (Référentiel Pédologique, WRB). (Source : INRA)
in scheme: PLP
preferred label: arenosols @en
top concept of: PLP

RDF description of
primary topic: arénosols