RDF description of
primary topic: podzosols

podzosols
type: Concept
definition: Solums dans lesquels le processus de podzolisation est jugé dominant (Référentiel Pédologique). (Source : INRA)
in scheme: PLP
note: Le concept de podzolisation implique : - un processus biogéochimique d'altération dit acido-complexolyse, défini comme une attaque des minéraux primaires par des solutions contenant des composés organiques acides et complexants. Cette attaque a pour effet l'élimination de l'aluminium et du fer ainsi que celle des cations alcalins et alcalinoterreux. Il se forme alors un horizon résiduel, essentiellement quartzeux, correspondant à un horizon éluvial E (parfois peu visible car masqué par des matières organiques) ; un processus de migration et d'immobilisation des constituants organiques et de complexes organo-minéraux d'aluminium et/ou de fer. L'accumulation de ces substances conduit à la formation d'un horizon podzolique BP. L'hypothèse d'une migration de l'aluminium sous forme de composés alumino-siliciques (proto-imogolite) et leur immobilisation sous forme d'imogolite dans les horizons BP a été avancée. (Source : INRA)
related: http://opendata.inrae.fr/PLP/726
related: http://opendata.inrae.fr/PLP/727
related: http://opendata.inrae.fr/PLP/176
related: http://opendata.inrae.fr/PLP/729
related: http://opendata.inrae.fr/PLP/510
related: http://opendata.inrae.fr/PLP/445
related: http://opendata.inrae.fr/PLP/475
top concept of: PLP