RDF description of
primary topic: polder

polder
type: Concept
subject: Pedology @en
subject: Pédologie
definition: Terrain constitué de sédiments récents, marins ou fluvio-marins, de granulométrie fine, isolé des invasions marines par des digues. (Source : INRA)
in scheme: PLP
note: À partir du moment où ces matériaux sont endigués, la mise en valeur comporte différentes phases : évacuation par gravité ou pompage des eaux en excès par des réseaux de canaux, de fossés et de drains ; contrôle du niveau de la nappe ; irrigation par des eaux douces ; implantation de prairies puis, dans un second temps, mise en culture ; fertilisation ; gypsage ; amendements calcaires ou organiques, etc. Dans ces conditions artificielles, un sol salé peut se voir dessaler par les pluies en quelques années. (Source : INRA)
related: http://opendata.inrae.fr/PLP/967
top concept of: PLP