RDF description of
primary topic: polygénétique

polygénétique
type: Concept
subject: Pedology @en
subject: Pédologie
definition: Qualifie un solum dont la pédogenèse actuelle se superpose à d'autres pédogenèses antérieures différentes, lesquelles expliquent certains caractères morphologiques ou minéralogiques. (Source : INRA)
in scheme: PLP
preferred label: polygenetic @en
related: http://opendata.inrae.fr/PLP/672
related: http://opendata.inrae.fr/PLP/22
top concept of: PLP