porosité
type: Concept
subject: Pedology @en
subject: Pédologie
definition: Ensemble des volumes d'un échantillon de sol ou d'un horizon non occupés par la phase solide et disponibles de ce fait soit pour l'air, soit pour le stockage ou la circulation des fluides. (Source : INRA)
in scheme: PLP
note: Au laboratoire, la porosité est quantifiée par le rapport du volume non occupé par de la matière solide (volume d'air plus volume d'eau) sur le volume total V d'un échantillon de sol. V est un volume apparent, c'est-à-dire qu'il correspond à l' enveloppe externe de l'échantillon considéré. Englobés dans cette porosité totale, il existe toutes sortes de vides très différents quant à leurs formes (tubules, cavités, fissures planaires, chambres, vésicules) ; leurs origines (entassement, retrait, activité faunique ou racinaire) ; leurs dimensions. (Source : INRA)
preferred label: soil porosity @en
related: http://opendata.inrae.fr/PLP/1002
related: http://opendata.inrae.fr/PLP/609
related: http://opendata.inrae.fr/PLP/939
related: http://opendata.inrae.fr/PLP/263
related: http://opendata.inrae.fr/PLP/582
related: http://opendata.inrae.fr/PLP/740
related: http://opendata.inrae.fr/PLP/520
related: http://opendata.inrae.fr/PLP/741
related: http://opendata.inrae.fr/PLP/339
top concept of: PLP

RDF description of
primary topic: porosité