argilane
type: Concept
subject: Micromorphology @en
subject: Pedology @en
subject: Pédologie
subject: Micromorphologie
alternative label: revêtement argileux
alternative label: clay-skin @en
definition: Cutane constitué essentiellement d'argiles. (Source : INRA)
in scheme: PLP
preferred label: argillan @en
related: http://opendata.inrae.fr/PLP/815
related: http://opendata.inrae.fr/PLP/459
related: http://opendata.inrae.fr/PLP/358
top concept of: PLP

RDF description of
primary topic: argilane