porosité structurale
type: Concept
subject: Pedology @en
subject: Pédologie
definition: Porosité du sol dont la mesure est accessible sur des mottes ou des ensembles de mottes de volumes importants. (Source : INRA)
in scheme: PLP
note: Elle intègre une porosité fissurale (intra- et inter-agrégats) et une porosité biologique, voire d'origine culturale. (Source : INRA)
preferred label: structural porosity @en
related: http://opendata.inrae.fr/PLP/738
top concept of: PLP

RDF description of
primary topic: porosité structurale