porosité texturale
type: Concept
subject: Pedology @en
subject: Pédologie
definition: Porosité d'assemblage élémentaire des particules, accessible en mesurant la porosité de fragments d'agrégats de plus en plus petits jusqu'à une valeur de porosité limite. (Source : INRA)
in scheme: PLP
note: Au sein d'un horizon non homogénéisé par le travail du sol, il peut exister plusieurs modes d'assemblages élémentaires, donc plusieurs valeurs de porosités texturales. (Source : INRA)
preferred label: textural porosity @en
related: http://opendata.inrae.fr/PLP/738
related: http://opendata.inrae.fr/PLP/939
top concept of: PLP

RDF description of
primary topic: porosité texturale