RDF description of
primary topic: porphyrique

porphyrique
type: Concept
subject: Pedology @en
subject: Pédologie
definition: Qualifie un mode d'arrangement des constituants les plus fins (plasma) et des grains du squelette, dans lequel ces derniers sont entièrement noyés dans la masse du plasma, sans pores interstitiels visibles à cette échelle. (Source : INRA)
in scheme: PLP
preferred label: porphyric @en
top concept of: PLP