RDF description of
primary topic: préparation de la terre fine

préparation de la terre fine
type: Concept
subject: Pedology @en
subject: Pédologie
definition: Ensemble des opérations destinées à obtenir, à partir d'un échantillon de sol, une poudre homogène et représentative sur laquelle seront réalisées diverses déterminations analytiques. (Source : INRA)
in scheme: PLP
note: Les trois opérations successives sont : le séchage, l'émottage, puis le tamisage à 2 mm. Deux objectifs sont poursuivis : - émietter considérablement les agrégats, quand il y a lieu, pour obtenir une poudre dans un état standard et sur laquelle seront réalisées les différentes déterminations analytiques (lesquelles concerneront donc la terre fine séchée à l'air). La terre fine ainsi obtenue est un mélange statistique qui gomme les hétérogénéités internes à l'horizon considéré et où les constituants de la matrice dominent en général largement ceux des traits pédologiques ; - déterminer le taux pondéral d'éléments grossiers par rapport à la terre brute totale. Il faut demeurer vigilant à ne pas salir l'échantillon (par un matériel mal lavé, par exemple) et à ne pas modifier sa granulométrie car il ne s'agit pas d'un broyage. (Source : INRA)
preferred label: preparation of the fine earth @en
related: http://opendata.inrae.fr/PLP/121
related: http://opendata.inrae.fr/PLP/652
related: http://opendata.inrae.fr/PLP/960
related: http://opendata.inrae.fr/PLP/323
top concept of: PLP