RDF description of
primary topic: profondeur d'enracinement maximale

profondeur d'enracinement maximale
type: Concept
subject: Pedology @en
subject: Pédologie
alternative label: PEM
alternative label: profondeur effective du sol
definition: Profondeur limite exploitable par les racines, à moduler selon l'espèce végétale considérée, en un site déterminé. (Source : INRA)
in scheme: PLP
note: La PEM sert à estimer le réservoir utilisable maximal d'un solum, d'une unité typologique ou d'une unité cartographique. Celui-ci est égal à la somme des réservoirs utilisables de chaque horizon jusqu'à la PEM. (Source : INRA)
preferred label: maximum rooting depth @en
related: http://opendata.inrae.fr/PLP/654
related: http://opendata.inrae.fr/PLP/757
top concept of: PLP