RDF description of
primary topic: profondeur utilisable maximale

profondeur utilisable maximale
type: Concept
subject: Pedology @en
subject: Pédologie
alternative label: PUM
definition: Profondeur d'enracinement maximal estimée de façon générale,c'est-à-dire pour toutes les plantes cultivées ou toutes les essences forestières, en vue de caractériser un solum ou une unité typologique. (Source : INRA)
in scheme: PLP
note: On est donc réduit à juger de la profondeur du sol jusqu'à l'apparition d'un obstacle ou du matériau parental intact non prospectable. (Source : INRA)
preferred label: maximum available depth @en
related: http://opendata.inrae.fr/PLP/809
related: http://opendata.inrae.fr/PLP/655
related: http://opendata.inrae.fr/PLP/756
top concept of: PLP