propriétés mécaniques
type: Concept
subject: Pedology @en
subject: Pédologie
definition: Ensemble des propriétés de comportement physique d'échantillons de sols, évalués par des tests de terrain ou de laboratoire. (Source : INRA)
in scheme: PLP
note: Dans une fosse, un certain nombre de tests peuvent être effectués pour évaluer les propriétés mécaniques de chaque horizon. Ils s'appliquent à des états d'humidité différents, soit naturels, soit obtenus par humectation. Au laboratoire, des méthodes plus ou moins sophistiquées existent, courantes en physique du sol (limites de liquidité et de plasticité d'Atterberg ; test de compactage Proctor ; tests de cisaillement par oedométrie ; etc.). (Source : INRA)
preferred label: mechanical properties @en
top concept of: PLP

RDF description of
primary topic: propriétés mécaniques