propriétés de rétention en eau
type: Concept
subject: Pedology @en
subject: Pédologie
alternative label: water-holding properties @en
definition: Ensemble des propriétés liées à la rétention de l'eau dans les diverses porosités déterminées pour un certain volume de sol. (Source : INRA)
in scheme: PLP
note: Ces propriétés sont quantifiées par la détermination des quantités d'eau présentes dans un échantillon de sol (ou in situ) à différents états de contraintes, d'où l'intérêt des courbes de rétention où l'on porte les quantités d'eau en fonction du pF. Ces quantités peuvent être exprimées sous la forme de proportions pondérales ou de proportions volumiques. (Source : INRA)
preferred label: water-retention properties @en
related: http://opendata.inrae.fr/PLP/151
related: http://opendata.inrae.fr/PLP/805
related: http://opendata.inrae.fr/PLP/808
related: http://opendata.inrae.fr/PLP/152
related: http://opendata.inrae.fr/PLP/486
related: http://opendata.inrae.fr/PLP/514
related: http://opendata.inrae.fr/PLP/732
related: http://opendata.inrae.fr/PLP/701
related: http://opendata.inrae.fr/PLP/149
top concept of: PLP

RDF description of
primary topic: propriétés de rétention en eau