RDF description of
primary topic: argiles à silex

argiles à silex
type: Concept
subject: Geology @en
subject: Pedology @en
subject: Géologie
subject: Pédologie
definition: Argiles de décarbonatation, riches en fer et contenant des quantités variables de silex, résultant de l'altération, sur de très longues durées, de certaines craies du Crétacé supérieur (Normandie, Picardie, Faux Perche). (Source : INRA)
in scheme: PLP
preferred label: clays with flints @en
related: http://opendata.inrae.fr/PLP/856
top concept of: PLP