propriétés vertiques
type: Concept
subject: Pedology @en
subject: Pédologie
definition: Propriétés communes à divers horizons dits vertiques qu'ils soient situés en surface (horizons Av) ou en profondeur (horizons SV et V), qui résultent d'une teneur en argile supérieure à 40 % et d'une présence dominante de smectites. (Source : INRA)
in scheme: PLP
note: Les horizons à propriétés vertiques présentent une CEC très élevée, un complexe adsorbant saturé, une forte densité apparente et une faible macro-porosité des agrégats. L'expression de ces propriétés est sous la dépendance de la dynamique du dessèchement (lequel est d'autant plus intense que l'horizon considéré est proche de la surface) et du poids des horizons sus-jacents (d'autant plus grand que l'horizon considéré est profond). (Source : INRA)
preferred label: vertic properties @en
related: http://opendata.inrae.fr/PLP/94
related: http://opendata.inrae.fr/PLP/924
related: http://opendata.inrae.fr/PLP/1001
related: http://opendata.inrae.fr/PLP/484
related: http://opendata.inrae.fr/PLP/862
related: http://opendata.inrae.fr/PLP/922
top concept of: PLP

RDF description of
primary topic: propriétés vertiques