pseudomycéliums
type: Concept
subject: Pedology @en
subject: Pédologie
definition: Fins dépôts de calcite secondaire soulignant la porosité d'origine radiculaire ou tapissant des fissures ou des faces d'agrégats, ayant la forme de fins filaments et ressemblant donc à des hyphes de champignons. (Source : INRA)
in scheme: PLP
preferred label: pseudomycelia @en
related: http://opendata.inrae.fr/PLP/637
related: http://opendata.inrae.fr/PLP/319
top concept of: PLP

RDF description of
primary topic: pseudomycéliums