RDF description of
primary topic: pureté

pureté
type: Concept
subject: Pedology @en
subject: Pédologie
alternative label: intensité
definition: Axe de l'espace des couleurs à trois dimensions et coordonnées cylindriques. (Source : INRA)
in scheme: PLP
note: La pureté correspond à une dilution croissante de la teinte de base. (Source : INRA)
preferred label: chroma @en
related: http://opendata.inrae.fr/PLP/225
related: http://opendata.inrae.fr/PLP/635
top concept of: PLP