RDF description of
primary topic: qualificatifs

qualificatifs
type: Concept
subject: Pedology @en
subject: Pédologie
definition: Adjectifs ou périphrases qui, ajoutés au nom d'une référence, permettent de transmettre un maximum d'informations relatives aux caractères spécifiques d'un solum ou d'une unité typologique aussi bien en ce qui concerne ses propriétés intrinsèques (minéralogie, texture, structure, signes d'hydromorphie, épaisseur, présence d'horizons particuliers, forme d'humus, matériau parental) que des propriétés extrinsèques (position dans le paysage, végétation, actions de l'homme) (Référentiel Pédologique). (Source : INRA)
in scheme: PLP
preferred label: qualifiers @en
related: http://opendata.inrae.fr/PLP/98
related: http://opendata.inrae.fr/PLP/777
top concept of: PLP