RDF description of
primary topic: raisonnement isoélément

raisonnement isoélément
type: Concept
subject: Pedology @en
subject: Pédologie
alternative label: bilan isoélément
definition: Raisonnement qui permet de calculer pertes et gains de matières dans les horizons supérieurs d'un solum au cours de la pédogenèse par rapport à un horizon profond supposé non ou peu altéré et servant d'horizon de référence. (Source : INRA)
in scheme: PLP
note: Ces calculs sont réalisés à partir des compositions des horizons, un élément chimique (supposé immobile sous les conditions pédoclimatiques de la station) servant d'invariant. Exemple : raisonnement isotitane. Ce type de raisonnement est plus simple que le raisonnement isominéral, mais rares sont les éléments qui ne sont pas susceptibles de migrer et ne sont pas associés à des minéraux altérables. (Source : INRA)
preferred label: iso-element mass balance @en
related: http://opendata.inrae.fr/PLP/769
related: http://opendata.inrae.fr/PLP/770
related: http://opendata.inrae.fr/PLP/1010
top concept of: PLP