raisonnement isominéral
type: Concept
subject: Pedology @en
subject: Pédologie
alternative label: bilan isominéral
definition: Raisonnement de même nature que le raisonnement isoélément mais dans lequel c'est un minéral, supposé non ou très peu altérable sous les conditions pédoclimatiques de la station, qui sert d'invariant. (Source : INRA)
in scheme: PLP
note: Exemple : raisonnement isoquartz, raisonnement isozircon. Un tel raisonnement est plus complexe que le simple raisonnement isoélément car il nécessite une reconstitution minéralogique (le taux de quartz ne se confond pas avec le taux de silicium). (Source : INRA)
preferred label: isomineral balance @en
related: http://opendata.inrae.fr/PLP/770
related: http://opendata.inrae.fr/PLP/768
related: http://opendata.inrae.fr/PLP/767
top concept of: PLP

RDF description of
primary topic: raisonnement isominéral