raisonnement typologique
type: Concept
subject: Pedology @en
subject: Pédologie
alternative label: démarche typologique
alternative label: typological approach @en
definition: Raisonnement basé sur l'hypothèse que si certains territoires ont exactement le même matériau parental , la même position dans le paysage, la même histoire et présentent donc le même solum, alors les sols de ces territoires ont toutes les chances de présenter les mêmes constituants, les mêmes organisations, les mêmes fonctionnements et les mêmes aptitudes et contraintes à telle ou telle utilisation humaine. (Source : INRA)
in scheme: PLP
note: De nombreuses interventions humaines peuvent venir perturber la validité complète de ce raisonnement : changements de végétation, drainage agricole, chaulage, pollutions, compactage, etc. Le raisonnement typologique est cependant un outil efficace de généralisation spatiale et d'expertise ponctuelle à partir d'expérimentations et d'études localisées. (Source : INRA)
preferred label: typological reasoning @en
related: http://opendata.inrae.fr/PLP/848
related: http://opendata.inrae.fr/PLP/904
related: http://opendata.inrae.fr/PLP/990
top concept of: PLP

RDF description of
primary topic: raisonnement typologique