RDF description of
primary topic: rapport S/T

rapport S/T
type: Concept
subject: Pedology @en
subject: Pédologie
definition: Mode d'expression du taux de saturation où S est la somme des quatre principaux cations alcalins et alcalino-terreux (Ca2+, Mg2+, K+, Na+) et T symbolise la CEC. (Source : INRA)
in scheme: PLP
preferred label: S/T ratio @en
related: http://opendata.inrae.fr/PLP/150
related: http://opendata.inrae.fr/PLP/943
top concept of: PLP