RDF description of
primary topic: argiles gonflantes

argiles gonflantes
type: Concept
subject: Mineralogy @en
subject: Pedology @en
subject: Minéralogie
subject: Pédologie
alternative label: swelling clay minerals @en
alternative label: minéraux argileux expansibles
definition: Minéraux argileux dont les espaces interfoliaires sont occupés par des cations Na, Ca ou Mg plus ou moins hydratés et capables de ce fait de gonfler en adsorbant une ou plusieurs couches d'eau entre leurs feuillets. (Source : INRA)
in scheme: PLP
note: Exemple: smectites, vermiculites. (Source : INRA)
preferred label: swelling clays @en
related: http://opendata.inrae.fr/PLP/417
related: http://opendata.inrae.fr/PLP/1001
related: http://opendata.inrae.fr/PLP/65
related: http://opendata.inrae.fr/PLP/365
related: http://opendata.inrae.fr/PLP/863
top concept of: PLP