rédoxique
type: Concept
subject: Pedology @en
subject: Pédologie
definition: Qualifie un horizon dans lequel un engorgement temporaire plus ou moins prolongé engendre des cycles d'oxydoréduction, la ségrégation du fer et l'apparition de bariolages accompagnés souvent de la formation de nodules ferro-manganiques (Référentiel Pédologique). (Source : INRA)
in scheme: PLP
note: Ce qualificatif peut aussi désigner un solum (autre qu'un Rédoxisol, un planosol ou un Luvisol Dégradé) dans lequel un horizon g ou -g débute entre 50 et 80 cm de profondeur. (Source : INRA)
preferred label: redoxic @en
related: http://opendata.inrae.fr/PLP/97
related: http://opendata.inrae.fr/PLP/499
related: http://opendata.inrae.fr/PLP/673
related: http://opendata.inrae.fr/PLP/783
related: http://opendata.inrae.fr/PLP/476
related: http://opendata.inrae.fr/PLP/785
related: http://opendata.inrae.fr/PLP/589
related: http://opendata.inrae.fr/PLP/413
related: http://opendata.inrae.fr/PLP/669
top concept of: PLP

RDF description of
primary topic: rédoxique