RDF description of
primary topic: Rédoxisols

Rédoxisols
type: Concept
subject: Pedology @en
subject: Pédologie
definition: Solums dans lesquels les processus d'oxydoréduction sont jugés prédominants, voire seuls à s'exprimer et dont le fonctionnement est dominé par l'existence de saturations temporaires par l'eau, plus ou moins prolongées (Référentiel Pédologique). (Source : INRA)
in scheme: PLP
note: Ils présentent parfois un épisolum humifère épais et foncé. (Source : INRA)
related: http://opendata.inrae.fr/PLP/782
related: http://opendata.inrae.fr/PLP/499
related: http://opendata.inrae.fr/PLP/761
related: http://opendata.inrae.fr/PLP/786
related: http://opendata.inrae.fr/PLP/476
related: http://opendata.inrae.fr/PLP/669
related: http://opendata.inrae.fr/PLP/413
top concept of: PLP