réduction
type: Concept
subject: Pedology @en
subject: Pédologie
definition: Élimination de l'oxygène dans l'atmosphère d'un volume de sol consécutive à un engorgement par l'eau suffisamment durable. (Source : INRA)
in scheme: PLP
note: En présence de fer, la réduction se manifeste par des volumes colorés en gris bleuâtre ou gris verdâtre, le fer se trouvant alors à l'état ferreux. L'anoxie a un grand impact sur les populations de micro-organismes et sur la respiration des racines (anaérobiose). (Source : INRA)
preferred label: reduction @en
related: http://opendata.inrae.fr/PLP/477
related: http://opendata.inrae.fr/PLP/58
related: http://opendata.inrae.fr/PLP/323
related: http://opendata.inrae.fr/PLP/786
related: http://opendata.inrae.fr/PLP/785
related: http://opendata.inrae.fr/PLP/669
related: http://opendata.inrae.fr/PLP/326
top concept of: PLP

RDF description of
primary topic: réduction