RDF description of
primary topic: réductique

réductique
type: Concept
subject: Pedology @en
subject: Pédologie
definition: Qualifie un horizon ou une partie de celui-ci, dans lequel un engorgement permanent ou quasi-permanent engendre l'anoxie, la réduction du fer et l'apparition de couleurs gris-bleu ou gris verdâtre (Référentiel Pédologique). (Source : INRA)
in scheme: PLP
note: Ce qualificatif peut désigner également un solum, autre qu'un réductisol, dans lequel un horizon réductique G débute entre 50 et 80 cm de profondeur. (Source : INRA)
preferred label: reductic @en
related: http://opendata.inrae.fr/PLP/782
related: http://opendata.inrae.fr/PLP/784
related: http://opendata.inrae.fr/PLP/477
related: http://opendata.inrae.fr/PLP/786
top concept of: PLP